{"text_format":"1","workbook":"xlsx","n_sheets":20,"sheets":["BRSPorc","Menu","Elevage","Aliments","Stock_Début","Stock_Fin","Litières","Récapitulatif","Excrétion","Bilan Simplifié","Standard","Gra_N","Gra_P","Gra_K","Données","Cohérence","CheckList","Analyse","Imprimer","Feuil1"],"not_rendered":{"charts":13,"images":3,"macros":1,"external_links":0,"defined_names":42,"comments":4,"pivot_tables":0},"unopened":[],"bounds":{"document_bytes":16777216,"sheet_cells":100000,"rows_first":2000,"rows_last":500,"rows_between":2000,"halvings":0,"cell_chars":16384,"cell_head_chars":4096},"cells_cut":0,"cells_raw":0,"read":"whole","date_system":"1900"}

{"sheet":"BRSPorc","index":0,"n_rows":40,"n_cols":6,"rows_kept":40,"cut":false,"hidden":false,"merged":[[4,3,4,7]]}
[]
[]
[null,null,null,null,null,"Bilan Réel Simplifié \"Porc\""]
[]
[null,null,null,"D'après le document du RMT Elevage et Environnement"]
[]
[null,null,null,null,null,"Evaluation des rejets d’azote - phosphore - "]
[null,null,null,null,null,"potassium - cuivre et zinc des porcs."]
[null,null,null,null,null,"Influence de l'alimentation, du mode de logement"]
[null,null,null,null,null,"et de la gestion des effluents (2016)"]
[]
[]
[]
[]
[]
{"$rows_left_out":26}
{"sheet":"Menu","index":1,"n_rows":25,"n_cols":6,"rows_kept":25,"cut":false,"hidden":false,"merged":[[3,3,3,8],[9,3,9,8],[15,3,15,8],[21,3,21,8]]}
[]
[]
[]
[null,null,null,"Saisie des caractéristiques de l'élevage "]
[]
[]
[]
[]
[]
[null,null,null,"Affichage des résultats"]
[]
[]
[]
[]
[]
{"$rows_left_out":11}
{"sheet":"Elevage","index":2,"n_rows":70,"n_cols":58,"rows_kept":70,"cut":false,"hidden":false,"merged":[]}
[]
[]
[null,"Références","EARL Pemoc'h Gouez"]
[null,"de l'élevage","200 truies naisseur-engraisseur"]
[]
[]
[null,"PERIODE de BILAN"]
[]
[null,"Date début","2017-01-01",null,null,null,null,null,null,null,null,{"$f":"IF(E9>1900,E9-1900,E9)","v":0},{"$f":"C9","v":"2017-01-01"}]
[null,"Date fin",{"$f":"C9+C11-1","v":"2017-12-31"},null,null,null,null,null,null,null,null,{"$f":"IF(E10>1900,E10-1900,E10)","v":0},{"$f":"C10","v":"2017-12-31"}]
[null,"Durée",{"$f":"DATE(YEAR(C9)+1,MONTH(C9),DAY(C9))-DATE(YEAR(C9),MONTH(C9),DAY(C9))","v":365}]
[]
[null,"EFFLUENTS"]
[]
[null,null,null,null,null,null,null,null,null,null,null,"Zone de calcul"]
{"$rows_left_out":56}
{"sheet":"Aliments","index":3,"n_rows":71,"n_cols":16,"rows_kept":71,"cut":false,"hidden":false,"merged":[[6,5,6,6]]}
[]
[null,null,null,{"$f":"IF(Elevage!C2<>0,Elevage!C2,\"\")","v":""}]
[null,null,"Références",{"$f":"IF(Elevage!C3<>0,Elevage!C3,\"\")","v":"EARL Pemoc'h Gouez"}]
[null,null,"de l'élevage",{"$f":"IF(Elevage!C4<>0,Elevage!C4,\"\")","v":"200 truies naisseur-engraisseur"}]
[null,null,null,{"$f":"IF(Elevage!C5<>0,Elevage!C5,\"\")","v":""},null,null,null,null,null,null,null,null,null,null,null,2]
[]
[null,null,"ALIMENTS",{"$f":"Elevage!M9","v":"2017-01-01"},"au",{"$f":"Elevage!M10","v":"2017-12-31"}]
[null,null,"  Aliment complets"]
[null,null,"  Matières premières","Quantité","Protéines","Phosphore","Potassium","Cuivre","Zinc","Azote","Phosphore","Potassium","Cuivre","Zinc"]
[null,null,"  Complémentaires","kg","%","total, %","%","ppm","ppm","kg","P, kg","K, kg","Cu, g","Zn, g"]
[null,null,"Type d'aliment",{"$f":"SUM(D12:D41)","v":1561151.5533000003},{"$f":"IF(D11<>0,J11*6.25/D11*100,\"\")","v":15.240673879320543},{"$f":"IF($D$11<>0,K11/$D$11*100,\"\")","v":0.46448807382053281},{"$f":"IF($D$11<>0,L11/$D$11*100,\"\")","v":0.65519778886831792},{"$f":"IF($D$11<>0,M11/$D$11*1000,\"\")","v":46.611643771664305},{"$f":"IF($D$11<>0,N11/$D$11*1000,\"\")","v":85.197929819079263},{"$f":"SUM(J12:J71)","v":38068.802720064006},{"$f":"SUM(K12:K71)","v":7251.3627793425003},{"$f":"SUM(L12:L71)","v":10228.630458105001},{"$f":"SUM(M12:M71)","v":72767.840076000008},{"$f":"SUM(N12:N71)","v":133006.88047500001}]
[null,1,"Truies lactation ",{"$f":"(Elevage!C23+Elevage!D23)/2*1225*0.26","v":57330},16,0.57999999999999996,0.7,30,100,{"$f":"IF(D12<>0,+E12/100*D12/6.25,\"\")","v":1467.6480000000001},{"$f":"IF(D12<>0,+F12/100*D12,\"\")","v":332.51399999999995},{"$f":"IF(D12<>0,+G12/100*D12,\"\")","v":401.30999999999995},{"$f":"IF(D12<>0,+H12/1000*D12,\"\")","v":1719.8999999999999},{"$f":"IF(D12<>0,+I12/1000*D12,\"\")","v":5733}]
[null,{"$f":"+B12+1","v":2},"Truies gestation",{"$f":"(Elevage!C23+Elevage!D23)/2*1225*0.74","v":163170},14,0.52,0.7,30,100,{"$f":"IF(D13<>0,+E13/100*D13/6.25,\"\")","v":3655.0080000000003},{"$f":"IF(D13<>0,+F13/100*D13,\"\")","v":848.48399999999992},{"$f":"IF(D13<>0,+G13/100*D13,\"\")","v":1142.1899999999998},{"$f":"IF(D13<>0,+H13/1000*D13,\"\")","v":4895.0999999999995},{"$f":"IF(D13<>0,+I13/1000*D13,\"\")","v":16317}]
[null,3,"Post sevrage",{"$f":"Elevage!C35*1.66*(31-8)","v":185237.81054999999},18.3,0.57499999999999996,0.79,170,100,5423.7630929039997,1065.1174106624999,1463.3787033450001,31490.427793500003,18523.781054999999]
[null,4,"Engraissement-Croissance",{"$f":"Elevage!C35*2.7*(Elevage!D35-31)*0.4","v":455865.4971000001},15.5,0.45,0.66,30,80,11305.464328080001,2051.3947369500006,3008.7122808600006,13675.964913000002,36469.239768000007]
{"$rows_left_out":57}
{"sheet":"Stock_Début","index":4,"n_rows":41,"n_cols":14,"rows_kept":41,"cut":false,"hidden":true,"merged":[[6,3,6,4]]}
[]
[null,null,null,{"$f":"IF(Elevage!C2<>0,Elevage!C2,\"\")","v":""}]
[null,null,"Références",{"$f":"IF(Elevage!C3<>0,Elevage!C3,\"\")","v":"EARL Pemoc'h Gouez"}]
[null,null,"de l'élevage",{"$f":"IF(Elevage!C4<>0,Elevage!C4,\"\")","v":"200 truies naisseur-engraisseur"}]
[null,null,null,{"$f":"IF(Elevage!C5<>0,Elevage!C5,\"\")","v":""}]
[]
[null,null,"ALIMENTS -  STOCKS DEBUT",{"$f":"Elevage!M9","v":"2017-01-01"}]
[]
[null,null,null,"Quantité","Protéines","Phosphore","Potassium","Cuivre","Zinc","Azote","Phosphore","Potassium","Cuivre","Zinc"]
[null,null,null,"kg","%","%","%","ppm","ppm","kg","P, kg","K, kg","Cu, g","Zn, g"]
[null,null,"Type d'aliment",{"$f":"SUM(D12:D41)","v":0},{"$f":"IF(D11<>0,J11*6.25/D11*100,\"\")","v":""},{"$f":"IF($D$11<>0,K11/$D$11*100,\"\")","v":""},{"$f":"IF($D$11<>0,L11/$D$11*100,\"\")","v":""},{"$f":"IF($D$11<>0,M11/$D$11*1000,\"\")","v":""},{"$f":"IF($D$11<>0,N11/$D$11*1000,\"\")","v":""},{"$f":"SUM(J12:J41)","v":0},{"$f":"SUM(K12:K41)","v":0},{"$f":"SUM(L12:L41)","v":0},{"$f":"SUM(M12:M41)","v":0},{"$f":"SUM(N12:N41)","v":0}]
[null,1,"Stock début",null,{"$f":"+Aliments!E11","v":15.240673879320543},{"$f":"+Aliments!F11","v":0.46448807382053281},{"$f":"+Aliments!G11","v":0.65519778886831792},{"$f":"+Aliments!H11","v":46.611643771664305},{"$f":"+Aliments!I11","v":85.197929819079263},{"$f":"IF(D12<>0,+E12/100*D12/6.25,\"\")","v":""},{"$f":"IF(D12<>0,+F12/100*D12,\"\")","v":""},{"$f":"IF(D12<>0,+G12/100*D12,\"\")","v":""},{"$f":"IF(D12<>0,+H12/1000*D12,\"\")","v":""},{"$f":"IF(D12<>0,+I12/1000*D12,\"\")","v":""}]
[null,{"$f":"+B12+1","v":2},null,null,null,null,null,null,null,{"$f":"IF(D13<>0,+E13/100*D13/6.25,\"\")","v":""},{"$f":"IF(D13<>0,+F13/100*D13,\"\")","v":""},{"$f":"IF(D13<>0,+G13/100*D13,\"\")","v":""},{"$f":"IF(D13<>0,+H13/1000*D13,\"\")","v":""},{"$f":"IF(D13<>0,+I13/1000*D13,\"\")","v":""}]
[null,3,null,null,null,null,null,null,null,"","","","",""]
[null,4,null,null,null,null,null,null,null,"","","","",""]
{"$rows_left_out":27}
{"sheet":"Stock_Fin","index":5,"n_rows":41,"n_cols":14,"rows_kept":41,"cut":false,"hidden":true,"merged":[[6,3,6,4]]}
[]
[null,null,null,{"$f":"IF(Elevage!C2<>0,Elevage!C2,\"\")","v":""}]
[null,null,"Références",{"$f":"IF(Elevage!C3<>0,Elevage!C3,\"\")","v":"EARL Pemoc'h Gouez"}]
[null,null,"de l'élevage",{"$f":"IF(Elevage!C4<>0,Elevage!C4,\"\")","v":"200 truies naisseur-engraisseur"}]
[null,null,null,{"$f":"IF(Elevage!C5<>0,Elevage!C5,\"\")","v":""}]
[]
[null,null,"ALIMENTS -  STOCKS FIN",{"$f":"Elevage!M10","v":"2017-12-31"}]
[]
[null,null,null,"Quantité","Protéines","Phosphore","Potassium","Cuivre","Zinc","Azote","Phosphore","Potassium","Cuivre","Zinc"]
[null,null,null,"kg","%","%","%","ppm","ppm","kg","P, kg","K, kg","Cu, g","Zn, g"]
[null,null,"Type d'aliment",{"$f":"SUM(D12:D41)","v":0},{"$f":"IF(D11<>0,J11*6.25/D11*100,\"\")","v":""},{"$f":"IF($D$11<>0,K11/$D$11*100,\"\")","v":""},{"$f":"IF($D$11<>0,L11/$D$11*100,\"\")","v":""},{"$f":"IF($D$11<>0,M11/$D$11*1000,\"\")","v":""},{"$f":"IF($D$11<>0,N11/$D$11*1000,\"\")","v":""},{"$f":"SUM(J12:J41)","v":0},{"$f":"SUM(K12:K41)","v":0},{"$f":"SUM(L12:L41)","v":0},{"$f":"SUM(M12:M41)","v":0},{"$f":"SUM(N12:N41)","v":0}]
[null,1,"Stock fin",null,{"$f":"Aliments!E11","v":15.240673879320543},{"$f":"+Aliments!F11","v":0.46448807382053281},{"$f":"+Aliments!G11","v":0.65519778886831792},{"$f":"+Aliments!H11","v":46.611643771664305},{"$f":"+Aliments!I11","v":85.197929819079263},{"$f":"IF(D12<>0,+E12/100*D12/6.25,\"\")","v":""},{"$f":"IF(D12<>0,+F12/100*D12,\"\")","v":""},{"$f":"IF(D12<>0,+G12/100*D12,\"\")","v":""},{"$f":"IF(D12<>0,+H12/1000*D12,\"\")","v":""},{"$f":"IF(D12<>0,+I12/1000*D12,\"\")","v":""}]
[null,{"$f":"+B12+1","v":2},null,null,null,null,null,null,null,{"$f":"IF(D13<>0,+E13/100*D13/6.25,\"\")","v":""},{"$f":"IF(D13<>0,+F13/100*D13,\"\")","v":""},{"$f":"IF(D13<>0,+G13/100*D13,\"\")","v":""},{"$f":"IF(D13<>0,+H13/1000*D13,\"\")","v":""},{"$f":"IF(D13<>0,+I13/1000*D13,\"\")","v":""}]
[null,3,null,null,null,null,null,null,null,"","","","",""]
[null,4,null,null,null,null,null,null,null,"","","","",""]
{"$rows_left_out":27}
{"sheet":"Litières","index":6,"n_rows":41,"n_cols":16,"rows_kept":41,"cut":false,"hidden":true,"merged":[[6,6,6,7]]}
[]
[null,null,null,{"$f":"IF(Elevage!C2<>0,Elevage!C2,\"\")","v":""}]
[null,null,"Références",{"$f":"IF(Elevage!C3<>0,Elevage!C3,\"\")","v":"EARL Pemoc'h Gouez"}]
[null,null,"de l'élevage",{"$f":"IF(Elevage!C4<>0,Elevage!C4,\"\")","v":"200 truies naisseur-engraisseur"}]
[null,null,null,{"$f":"IF(Elevage!C5<>0,Elevage!C5,\"\")","v":""}]
[]
[null,null,"Litière Utilisée",{"$f":"Elevage!M9","v":"2017-01-01"},null,"au",{"$f":"Elevage!M10","v":"2017-12-31"}]
[]
[null,null,null,"Quantité","MS","N Total","Phosphore","Potassium","Cuivre","Zinc","MS","Azote","Phosphore","Potassium","Cuivre","Zinc"]
[null,null,null,"kg","%","%","%","%","ppm","ppm","kg","kg","P, kg","K, kg","Cu, g","Zn, g"]
[null,null,"Type de litière",{"$f":"SUM(D12:D41)","v":0},{"$f":"IF(D11<>0,K11/D11*100,\"\")","v":""},{"$f":"IF(D11<>0,L11*6.25/D11*100,\"\")","v":""},{"$f":"IF($D$11<>0,M11/$D$11*100,\"\")","v":""},{"$f":"IF($D$11<>0,N11/$D$11*100,\"\")","v":""},{"$f":"IF($D$11<>0,O11/$D$11*1000,\"\")","v":""},{"$f":"IF($D$11<>0,P11/$D$11*1000,\"\")","v":""},{"$f":"SUM(K12:K41)","v":0},0,0,0,0,0]
[null,1,"Paille",null,88,0.5,0.08,0.94,0,0,{"$f":"IF(E12<>0,+E12/100*D12,\"\")","v":0},{"$f":"IF(E12<>0,+F12/100*D12,\"\")","v":0},{"$f":"IF(E12<>0,+G12/100*D12,\"\")","v":0},{"$f":"IF(E12<>0,+H12/100*D12,\"\")","v":0},{"$f":"IF(E12<>0,+I12/1000*D12,\"\")","v":0},{"$f":"IF(E12<>0,+J12/1000*D12,\"\")","v":0}]
[null,{"$f":"+B12+1","v":2},"Sciure",null,88,0.2,{"$f":"0.01*0.88","v":8.8000000000000005E-3},{"$f":"0.022*0.88","v":1.9359999999999999E-2},0,0,{"$f":"IF(E13<>0,+E13/100*D13,\"\")","v":0},{"$f":"IF(E13<>0,+F13/100*D13,\"\")","v":0},{"$f":"IF(E13<>0,+G13/100*D13,\"\")","v":0},{"$f":"IF(E13<>0,+H13/100*D13,\"\")","v":0},{"$f":"IF(E13<>0,+I13/1000*D13,\"\")","v":0},{"$f":"IF(E13<>0,+J13/1000*D13,\"\")","v":0}]
[null,3,null,null,null,null,null,null,null,null,"",{"$f":"IF(E14<>0,+F14/100*D14,\"\")","v":""},"","","",""]
[null,4,null,null,null,null,null,null,null,null,"","","","","",""]
{"$rows_left_out":27}
{"sheet":"Récapitulatif","index":7,"n_rows":34,"n_cols":7,"rows_kept":34,"cut":false,"hidden":false,"merged":[]}
[]
[null,null,null,null,"Bilan Réel Simplifié \"Porc\""]
[]
[]
[null,null,null,null,"D'après le document du RMT Elevage&Environnement"]
[]
[null,null,null,null,"Evaluation des rejets d’azote - phosphore - "]
[null,null,null,null,"potassium - cuivre et zinc des porcs."]
[null,null,null,null,"Influence de l'alimentation, du mode de logement"]
[null,null,null,null,"et de la gestation des effluents (2016)"]
[]
[]
[]
[]
[null,null,null,null,"Élevage"]
{"$rows_left_out":20}
{"sheet":"Excrétion","index":8,"n_rows":41,"n_cols":14,"rows_kept":41,"cut":false,"hidden":false,"merged":[[6,6,6,7]]}
[]
[null,null,null,null,null,"Excrétion de N et P2O5"]
[]
[null,null,null,null,null,"Élevage"]
[null,null,null,null,null,{"$f":"IF(Elevage!$C$3<>0,Elevage!$C$3,\"\")","v":"EARL Pemoc'h Gouez"}]
[null,null,null,null,null,{"$f":"IF(Elevage!C4<>0,Elevage!C4,\"\")","v":"200 truies naisseur-engraisseur"}]
[null,null,null,"du",{"$f":"Aliments!D7","v":"2017-01-01"},"au",{"$f":"Aliments!F7","v":"2017-12-31"}]
[]
[]
[null,null,null,null,null,"Nombre de places"]
[]
[null,null,null,"Truies",null,null,210]
[null,null,null,"  dont maternité",null,null,44]
[null,null,null,"  dont gestation",null,null,{"$f":"IF(G12>0,G12-G13,\"\")","v":166}]
[null,null,null,"Porcelets post-sevrage",null,null,850]
{"$rows_left_out":27}
{"sheet":"Bilan Simplifié","index":9,"n_rows":59,"n_cols":9,"rows_kept":59,"cut":false,"hidden":false,"merged":[[15,7,15,8],[15,6,16,6],[21,3,21,4],[21,5,21,6],[39,6,39,7],[17,7,17,8],[16,7,16,8]]}
[]
[null,null,{"$f":"IF(Elevage!C2<>0,Elevage!C2,\"\")","v":""}]
[null,"Références",{"$f":"IF(Elevage!C3<>0,Elevage!C3,\"\")","v":"EARL Pemoc'h Gouez"}]
[null,"de l'élevage",{"$f":"IF(Elevage!C4<>0,Elevage!C4,\"\")","v":"200 truies naisseur-engraisseur"}]
[null,null,{"$f":"IF(Elevage!C5<>0,Elevage!C5,\"\")","v":""}]
[]
[null,"Effluent",{"$f":"+Elevage!L66","v":"100% LISIER (en % de N excrété)"}]
[]
[]
[null,"ELEVAGE",null,null,"LITIERE"]
[null,null,null,null,null,null,"kg brut","kg MS","%MS"]
[null," Début de période",{"$f":"Elevage!M9","v":"2017-01-01"},null,"Quantité totale utilisée",null,{"$f":"+Litières!D11","v":0},{"$f":"IF(G12<>0,+G12*I12/100,\"\")","v":""},{"$f":"+Litières!E11","v":""}]
[null," Fin de période",{"$f":"Elevage!M10","v":"2017-12-31"}]
[null," Durée",{"$f":"+C13-C12+1","v":365},null,"EMANATIONS GAZEUSES, % N excrété"]
[null," Truies en production",{"$f":"(Elevage!C23+Elevage!D23)/2","v":180}]
{"$rows_left_out":45}
{"sheet":"Standard","index":10,"n_rows":42,"n_cols":34,"rows_kept":42,"cut":false,"hidden":true,"merged":[[16,8,16,9],[25,8,25,9],[34,8,34,9],[16,1,16,5],[25,1,25,5],[34,1,34,5]]}
["Feuille de calcul - ne pas supprimer"]
[null,null,{"$f":"IF(Elevage!C2<>0,Elevage!C2,\"\")","v":""}]
[null,"Références",{"$f":"IF(Elevage!C3<>0,Elevage!C3,\"\")","v":"EARL Pemoc'h Gouez"}]
[null,"de l'élevage",{"$f":"IF(Elevage!C4<>0,Elevage!C4,\"\")","v":"200 truies naisseur-engraisseur"}]
[null,null,{"$f":"IF(Elevage!C5<>0,Elevage!C5,\"\")","v":""}]
[]
[null,{"$f":"+'Bilan Simplifié'!B7","v":"Effluent"},{"$f":"+'Bilan Simplifié'!C7","v":"100% LISIER (en % de N excrété)"}]
[]
[]
[null,"BILAN","N","P","K"]
[null,"Ingéré",{"$f":"'Bilan Simplifié'!C24","v":38068.802720064006},{"$f":"'Bilan Simplifié'!D24","v":7251.3627793425003},{"$f":"+'Bilan Simplifié'!F24","v":10228.630458105001}]
[null,"Retenu",{"$f":"+'Bilan Simplifié'!C27+'Bilan Simplifié'!C26","v":15315.768272181365},{"$f":"+'Bilan Simplifié'!D27+'Bilan Simplifié'!D26","v":3206.5455317500005},{"$f":"+'Bilan Simplifié'!F27+'Bilan Simplifié'!F26","v":1267.2400200354},null,null,null,null,null,null,null,null,null,null,null,{"$f":"HLOOKUP(Elevage!$K$51+4,Standard!$N$18:$T$23,5)","v":1.21}]
[null,"Air",{"$f":"+'Bilan Simplifié'!C29","v":6671.1897001191901}]
[null,{"$f":"CONCATENATE(\"Effluent\",\"*\")","v":"Effluent*"},{"$f":"+'Bilan Simplifié'!C30","v":16081.844747763451},{"$f":"+'Bilan Simplifié'!D30","v":4044.8172475924998},{"$f":"+'Bilan Simplifié'!F30","v":8961.3904380696003}]
[]
{"$rows_left_out":28}
{"sheet":"Gra_N","index":11,"n_rows":30,"n_cols":17,"rows_kept":30,"cut":false,"hidden":false,"merged":[[15,7,15,11],[4,5,7,7],[10,2,11,10]]}
[]
[null,null,null,null,null,null,{"$f":"Récapitulatif!E17","v":"EARL Pemoc'h Gouez"}]
[null,null,null,null,null,null,{"$f":"Récapitulatif!E18","v":"200 truies naisseur-engraisseur"}]
[null,null,null,null,null,null,{"$f":"Récapitulatif!E19","v":""}]
[null,null,null,null,null,"Bilan d'azote"]
[]
[]
[]
[null,null,null,null,"du",{"$f":"Elevage!C9","v":"2017-01-01"},"au",{"$f":"Elevage!C10","v":"2017-12-31"}]
[]
[null,null,{"$f":"Elevage!L66","v":"100% LISIER (en % de N excrété)"}]
[]
[]
[]
[]
{"$rows_left_out":16}
{"sheet":"Gra_P","index":12,"n_rows":29,"n_cols":17,"rows_kept":29,"cut":false,"hidden":false,"merged":[[4,4,7,8],[17,9,17,10],[15,7,15,11],[10,2,11,10]]}
[]
[null,null,null,null,null,null,{"$f":"Récapitulatif!E17","v":"EARL Pemoc'h Gouez"}]
[null,null,null,null,null,null,{"$f":"Récapitulatif!E18","v":"200 truies naisseur-engraisseur"}]
[null,null,null,null,null,null,{"$f":"Récapitulatif!E19","v":""}]
[null,null,null,null,"Bilan de phosphore"]
[]
[]
[]
[null,null,null,null,"du",{"$f":"Elevage!C9","v":"2017-01-01"},"au",{"$f":"Elevage!C10","v":"2017-12-31"}]
[]
[null,null,{"$f":"Elevage!L66","v":"100% LISIER (en % de N excrété)"}]
[]
[]
[]
[]
{"$rows_left_out":15}
{"sheet":"Gra_K","index":13,"n_rows":29,"n_cols":17,"rows_kept":29,"cut":false,"hidden":false,"merged":[[4,4,7,8],[10,2,11,10],[15,7,15,11],[17,9,17,10]]}
[]
[null,null,null,null,null,null,{"$f":"Récapitulatif!E17","v":"EARL Pemoc'h Gouez"}]
[null,null,null,null,null,null,{"$f":"Récapitulatif!E18","v":"200 truies naisseur-engraisseur"}]
[null,null,null,null,null,null,{"$f":"Récapitulatif!E19","v":""}]
[null,null,null,null,"Bilan de potassium"]
[]
[]
[]
[null,null,null,null,"du",{"$f":"Elevage!C9","v":"2017-01-01"},"au",{"$f":"Elevage!C10","v":"2017-12-31"}]
[]
[null,null,{"$f":"Elevage!L66","v":"100% LISIER (en % de N excrété)"}]
[]
[]
[]
[]
{"$rows_left_out":15}
{"sheet":"Données","index":14,"n_rows":40,"n_cols":5,"rows_kept":40,"cut":false,"hidden":true,"merged":[[1,0,1,5]]}
["Feuille de calcul - ne pas supprimer"]
["BRSPorc : Analyses de la cohérence des données"]
[]
["Fichier"]
[]
[]
["Elevage",{"$f":"CONCATENATE(Elevage!$C$2)","v":""}]
[null,{"$f":"CONCATENATE(Elevage!$C$3)","v":"EARL Pemoc'h Gouez"},null,"du",{"$f":"Elevage!$C$9","v":"2017-01-01"}]
[null,{"$f":"CONCATENATE(Elevage!$C$4)","v":"200 truies naisseur-engraisseur"},null,"au ",{"$f":"Elevage!$C$10","v":"2017-12-31"}]
[null,{"$f":"CONCATENATE(Elevage!$C$5)","v":""}]
[]
["Performances"]
[null,"IC global, kg/kg",{"$f":"'Bilan Simplifié'!$C$18","v":2.666354807962056},null,"dans la feuille bilan simplifié"]
[null,"MAT aliment, %",{"$f":"Aliments!$E$11","v":15.240673879320543},null,"dans le feuille aliment"]
[null,"P aliment, %",{"$f":"Aliments!$F$11","v":0.46448807382053281},null,"dans le feuille aliment"]
{"$rows_left_out":26}
{"sheet":"Cohérence","index":15,"n_rows":43,"n_cols":26,"rows_kept":43,"cut":false,"hidden":false,"merged":[[0,20,0,28],[33,15,36,19],[37,15,41,19],[33,24,36,28],[37,24,40,28],[42,15,44,19],[37,6,46,9],[0,2,0,9],[0,11,0,19],[13,6,22,9],[15,16,24,19],[25,6,34,9],[31,13,31,15],[30,13,30,15],[29,13,29,15],[15,25,24,28],[29,22,29,24],[30,22,30,24],[31,22,31,24],[42,24,44,28]]}
[null,null,"BRSPorc : Analyses de la cohérence des données (1/2)",null,null,null,null,null,null,null,null,"BRSPorc : Analyses de la cohérence des données (2/2)",null,null,null,null,null,null,null,null,"BRSPorc : Analyses de la cohérence des données (3/3)"]
[]
[null,null,{"$f":"Données!A4","v":"Fichier"},{"$f":"MID(CELL(\"nomfichier\",A2),SEARCH(\"[\",CELL(\"nomfichier\",A2))+1,SEARCH(\"]\",CELL(\"nomfichier\",A2))-SEARCH(\"[\",CELL(\"nomfichier\",A2))-1)","v":"BrsPorc_2016_v4_01.xlsm"},null,null,null,null,null,null,null,"Caractéristiques de l'élevage"]
[null,null,null,null,null,null,null,null,null,null,null,{"$f":"Analyse!B159","v":"Compte tenu de ses ventes cet élevage peut être considéré à :"}]
[null,null,null,null,null,null,null,null,null,null,null,null,{"$f":"IF(Analyse!C6<>0,Analyse!C6,\"\")","v":1},{"$f":"IF(M5<>\"\",Analyse!B6,\"\")","v":"Naisseur engraisseur"}]
[null,null,{"$f":"Données!A7","v":"Elevage"},{"$f":"Données!B7","v":""},null,null,null,null,null,null,null,null,{"$f":"Analyse!C4","v":0},{"$f":"IF(M6<>\"\",Analyse!B4,\"\")","v":"Naisseur vente au sevrage"}]
[null,null,null,{"$f":"Données!B8","v":"EARL Pemoc'h Gouez"},null,null,{"$f":"Données!D8","v":"du"},{"$f":"Données!E8","v":"2017-01-01"},null,null,null,null,{"$f":"Analyse!C5","v":0},{"$f":"IF(M7<>\"\",Analyse!B5,\"\")","v":"Naisseur vente à 30 kg"}]
[null,null,null,{"$f":"Données!B9","v":"200 truies naisseur-engraisseur"},null,null,{"$f":"Données!D9","v":"au "},{"$f":"Données!E9","v":"2017-12-31"},null,null,null,null,{"$f":"Analyse!C7","v":0},{"$f":"IF(M8<>\"\",Analyse!B7,\"\")","v":"Post-sevreur"}]
[null,null,null,null,null,null,null,null,null,null,null,null,{"$f":"Analyse!C8","v":0},{"$f":"IF(M9<>\"\",Analyse!B8,\"\")","v":"Post sevreur-engraisseur"}]
[null,null,null,null,null,null,null,null,null,null,null,null,{"$f":"Analyse!C9","v":0},{"$f":"IF(M10<>\"\",Analyse!B9,\"\")","v":"Engraisseur"}]
[]
[]
[null,null,"Indice de consommation",null,null,null,null,null,null,null,null,null,"Quantité d'azote épandable",null,null,null,null,null,null,null,null,"Quantité de P2O5 épandable"]
[null,null,null,null,null,null,{"$f":"Analyse!K121","v":" - L'indice de consommation global (kg porc sorti / kg aliment entré) estimé par le BRS s'élève à 2.67 kg/kg. Ceci place l'élevage dans les 27% des  meilleurs compte tenu de la variablité des élevages suivis en Gestion Technico-Economique en 2014."}]
[]
{"$rows_left_out":29}
{"sheet":"CheckList","index":16,"n_rows":21,"n_cols":6,"rows_kept":21,"cut":false,"hidden":false,"merged":[[1,0,1,2]]}
[]
["Check-list des justificatifs"]
[]
[null,"Vérification de l'IC global"]
[null,null,"- Quantités d'aliments utilisées : Bilan Comptable ou Bilan de GTE",true,{"$f":"NOT(D5)","v":false}]
[null,null,"- Entrées et Sorties d'animaux : Bilan comptable ou Bilan de GTE",true,{"$f":"NOT(D6)","v":false}]
[]
[null,"Vérification de la composition des aliments en achat extérieur",null,{"$f":"IF($F$8=1,TRUE,FALSE)","v":true},{"$f":"NOT(D8)","v":false},1]
[null,null,"- Récapitulatif des livraisons avec teneur en protéines des aliments",true,{"$f":"NOT(D9)","v":false}]
[null,null,"- Récapitulatif des livraisons avec  teneur moyenne en phosphore des aliments",true,false]
[null,null,"- Récapitulatif des livraisons avec teneur en potassium des aliments",true,{"$f":"NOT(D11)","v":false}]
[]
[]
[null,"Vérification de la composition des aliments en FAF (option 1)",null,{"$f":"IF($F$8=2,TRUE,FALSE)","v":false},{"$f":"NOT(D14)","v":true}]
[null,null,"- Liste des formules utilisées avec calcul de la teneur moyenne pondérée en protéines",false,true]
{"$rows_left_out":7}
{"sheet":"Analyse","index":17,"n_rows":163,"n_cols":11,"rows_kept":163,"cut":false,"hidden":true,"merged":[[152,10,156,18],[157,10,157,18],[120,10,123,18],[125,10,128,18],[130,10,134,18],[135,10,140,18],[147,10,151,18],[141,10,145,18],[146,10,146,18]]}
[]
["Détermination des carcatéristiques de l'élevage"]
[]
[null,"Naisseur vente au sevrage",{"$f":"D4/$D$10","v":0},{"$f":"MAX(Données!C18-Données!C26,0)","v":0}]
[null,"Naisseur vente à 30 kg",0,{"$f":"MAX(Données!C19-D7,0)","v":0}]
[null,"Naisseur engraisseur",1,{"$f":"MAX((C13)-(D4+D5+D7+D8+D9),0)","v":4851.6975000000002}]
[null,"Post-sevreur",0,{"$f":"MIN(MAX((Données!C26-Données!C18),0),Données!C19)","v":0},{"$f":"MAX((Données!C26-Données!C18),0)","v":0}]
[null,"Post sevreur-engraisseur",0,{"$f":"IF(Données!C21<>0,MAX(Données!C26-Données!C18-D7,0),0)","v":0}]
[null,"Engraisseur",0,{"$f":"IF(Données!C21<>0,E9-D8-D7,0)","v":0},{"$f":"MAX(Données!C26-Données!C18,0)+MAX(Données!C27-Données!C19,0)","v":0}]
[null,"total ",1,{"$f":"SUM(D4:D9)","v":4851.6975000000002}]
[]
[null,null,"Total","NE_Sev","NE_PS","NE_E","PS","PS-E","E"]
[null,"Effectif vendu",{"$f":"SUM(Données!C18:C21)","v":4851.6975000000002},{"$f":"D4","v":0},{"$f":"D5","v":0},{"$f":"D6","v":4851.6975000000002},{"$f":"D7","v":0},{"$f":"D8","v":0},{"$f":"D9","v":0},null,{"$f":"SUM(D13:I13)","v":4851.6975000000002}]
[null,"Pourcentage de ventes",{"$f":"SUM(D14:I14)","v":1},{"$f":"D13/$C$13","v":0},0,1,0,0,0]
[null,null,"Elevage","N_sev","N_PS","NE_E","PS","PS-E","E"]
{"$rows_left_out":149}
{"sheet":"Imprimer","index":18,"n_rows":31,"n_cols":3,"rows_kept":31,"cut":false,"hidden":true,"merged":[]}
[]
[]
[]
[]
[]
[]
[]
[null,null,"Résultats des Calculs"]
[]
[]
[]
[]
[]
[]
[]
{"$rows_left_out":17}
{"sheet":"Feuil1","index":19,"n_rows":0,"n_cols":0,"rows_kept":0,"cut":false,"hidden":true,"merged":[]}